Target
Kappa-type opioid receptor
Ligand
BDBM62190
Substrate
Meas. Tech.
SAR analysis of Antagonists of the Kappa Opioid Receptor (KOR) using an Image-Based Assay
IC50
32000±n/a nM
Citation
 PubChem, PC SAR analysis of Antagonists of the Kappa Opioid Receptor (KOR) using an Image-Based Assay PubChem Bioassay (2010)[AID] 
Target
Name:
Kappa-type opioid receptor
Synonyms:
K-OR-1 Kappa-opioid receptor (KOR) Kappa-type opioid receptor (KOR) OPIATE Kappa OPRK1 kappa opioid receptor (KOR)
Type:
G Protein-Coupled Receptor (GPCR)
Mol. Mass.:
42648.76
Organism:
Homo sapiens (Human)
Description:
P41145
Residue:
380
  
Inhibitor
Name:
BDBM62190
Synonyms:
4-[[(4-acetylphenyl)sulfonylamino]methyl]-N-[2-(3-fluoroanilino)-2-keto-ethyl]-N-methyl-benzamide 4-[[(4-ethanoylphenyl)sulfonylamino]methyl]-N-[2-[(3-fluorophenyl)amino]-2-oxidanylidene-ethyl]-N-methyl-benzamide cid_16295215
Type:
Small organic molecule
Emp. Form.:
C25H24FN3O5S
Mol. Mass.:
497.539
SMILES:
CN(CC(=O)Nc1cccc(F)c1)C(=O)c1ccc(CNS(=O)(=O)c2ccc(cc2)C(C)=O)cc1
: