Target
Serine/threonine-protein kinase Sgk1
Ligand
BDBM268614
Substrate
Meas. Tech.
Enzymatic Activity Assay
pH
7.4±n/a
IC50
<1.20±n/a nM
Comments
extracted
Citation
 Nazare, MHalland, NSchmidt, FKleemann, HWeiss, TSaas, JStruebing, C N-(4-(azaindazol-6-yl)-phenyl)-sulfonamides and their use as pharmaceuticals US Patent  US9718825 Publication Date 8/1/2017 
Target
Name:
Serine/threonine-protein kinase Sgk1
Synonyms:
SGK SGK1_HUMAN Serine/threonine-protein kinase Sgk1 (SGK) Serum/glucocorticoid-regulated kinase 1 (SGK1)
Type:
Other Protein Type
Mol. Mass.:
48954.40
Organism:
Homo sapiens (Human)
Description:
Recombinant human SGK-1 enzyme produced in a baculovirus system.
Residue:
431
  
Inhibitor
Name:
BDBM268614
Synonyms:
US9718825, Example 10
Type:
Small organic molecule
Emp. Form.:
C18H13ClFN5O2S
Mol. Mass.:
417.845
SMILES:
Cc1n[nH]c2nc(ncc12)-c1ccc(NS(=O)(=O)c2cc(Cl)ccc2F)cc1
: