Target
Serine/threonine-protein kinase Sgk1
Ligand
BDBM269021
Substrate
Meas. Tech.
Enzymatic Activity Assay
pH
7.4±n/a
IC50
<1.20±n/a nM
Comments
extracted
Citation
 Nazare, MHalland, NSchmidt, FKleemann, HWeiss, TSaas, JStruebing, C N-(4-(azaindazol-6-yl)-phenyl)-sulfonamides and their use as pharmaceuticals US Patent  US9718825 Publication Date 8/1/2017 
Target
Name:
Serine/threonine-protein kinase Sgk1
Synonyms:
SGK SGK1_HUMAN Serine/threonine-protein kinase Sgk1 (SGK) Serum/glucocorticoid-regulated kinase 1 (SGK1)
Type:
Other Protein Type
Mol. Mass.:
48954.40
Organism:
Homo sapiens (Human)
Description:
Recombinant human SGK-1 enzyme produced in a baculovirus system.
Residue:
431
  
Inhibitor
Name:
BDBM269021
Synonyms:
US9718825, Example 464
Type:
Small organic molecule
Emp. Form.:
C18H14Cl2N6O2S
Mol. Mass.:
449.314
SMILES:
Cc1nc(nc2[nH]nc(N)c12)-c1ccc(NS(=O)(=O)c2cc(Cl)ccc2Cl)cc1
: