Target
Delta-type opioid receptor
Ligand
BDBM54816
Substrate
Meas. Tech.
SAR Analysis of Antagonists of the DOR Receptor using an Image-Based Assay
IC50
32000±n/a nM
Citation
 PubChem, PC SAR Analysis of Antagonists of the DOR Receptor using an Image-Based Assay PubChem Bioassay (2010)[AID] 
Target
Name:
Delta-type opioid receptor
Synonyms:
D-OR-1 Delta opioid receptor OPIATE Delta OPRD1 OPRK1 | opioid receptor, delta 1
Type:
G Protein-Coupled Receptor (GPCR)
Mol. Mass.:
40382.98
Organism:
Homo sapiens (Human)
Description:
Competition binding assays were carried out using membrane preparations from transfected HN9.10 cells that constitutively expressed the delta opioid receptor.
Residue:
372
  
Inhibitor
Name:
BDBM54816
Synonyms:
4-methyl-N-[9-(4-methylbenzyl)-9-azabicyclo[3.3.1]nonan-3-yl]benzamide MLS000709692 cid_3218139
Type:
Small organic molecule
Emp. Form.:
C24H30N2O
Mol. Mass.:
362.5078
SMILES:
[H]C12CCCC([H])(CC(C1)NC(=O)c1ccc(C)cc1)N2Cc1ccc(C)cc1
: