Target
Kappa-type opioid receptor
Ligand
BDBM62188
Substrate
Meas. Tech.
SAR analysis of Agonists of the Kappa Opioid Receptor (KOR) using an Image-Based Assay
EC50
>32000±n/a nM
Citation
 PubChem, PC SAR analysis of Agonists of the Kappa Opioid Receptor (KOR) using an Image-Based Assay PubChem Bioassay (2010)[AID] 
Target
Name:
Kappa-type opioid receptor
Synonyms:
K-OR-1 Kappa-opioid receptor (KOR) Kappa-type opioid receptor (KOR) OPIATE Kappa OPRK1 kappa opioid receptor (KOR)
Type:
G Protein-Coupled Receptor (GPCR)
Mol. Mass.:
42648.76
Organism:
Homo sapiens (Human)
Description:
P41145
Residue:
380
  
Inhibitor
Name:
BDBM62188
Synonyms:
(phenylmethyl) N-[2,2,2-tris(chloranyl)-1-[(2,5-dimethylphenyl)carbamothioylamino]ethyl]carbamate N-[2,2,2-trichloro-1-[(2,5-dimethylphenyl)thiocarbamoylamino]ethyl]carbamic acid benzyl ester benzyl N-[2,2,2-trichloro-1-[(2,5-dimethylphenyl)carbamothioylamino]ethyl]carbamate | cid_3091260
Type:
Small organic molecule
Emp. Form.:
C19H20Cl3N3O2S
Mol. Mass.:
460.805
SMILES:
Cc1ccc(C)c(NC(=S)NC(NC(=O)OCc2ccccc2)C(Cl)(Cl)Cl)c1
: