Target
Delta-type opioid receptor
Ligand
BDBM62182
Substrate
Meas. Tech.
SAR Analysis of Agonists of the DOR Receptor using an Image-Based Assay
EC50
>32000±n/a nM
Citation
 PubChem, PC SAR Analysis of Agonists of the DOR Receptor using an Image-Based Assay PubChem Bioassay (2010)[AID] 
Target
Name:
Delta-type opioid receptor
Synonyms:
D-OR-1 Delta opioid receptor OPIATE Delta OPRD1 OPRK1 | opioid receptor, delta 1
Type:
G Protein-Coupled Receptor (GPCR)
Mol. Mass.:
40382.98
Organism:
Homo sapiens (Human)
Description:
Competition binding assays were carried out using membrane preparations from transfected HN9.10 cells that constitutively expressed the delta opioid receptor.
Residue:
372
  
Inhibitor
Name:
BDBM62182
Synonyms:
2-[[4-(2-furanylmethyl)-5-(2-pyridinyl)-1,2,4-triazol-3-yl]thio]-N-(2-methoxy-5-methylphenyl)acetamide 2-[[4-(furan-2-ylmethyl)-5-pyridin-2-yl-1,2,4-triazol-3-yl]sulfanyl]-N-(2-methoxy-5-methyl-phenyl)ethanamide MLS-0058709.0001 | cid_662488
Type:
Small organic molecule
Emp. Form.:
C22H21N5O3S
Mol. Mass.:
435.499
SMILES:
COc1ccc(C)cc1NC(=O)CSc1nnc(-c2ccccn2)n1Cc1ccco1
: