Target
Delta-type opioid receptor
Ligand
BDBM54778
Substrate
Meas. Tech.
SAR Analysis of Agonists of the DOR Receptor using an Image-Based Assay
EC50
>32000±n/a nM
Citation
 PubChem, PC SAR Analysis of Agonists of the DOR Receptor using an Image-Based Assay PubChem Bioassay (2010)[AID] 
Target
Name:
Delta-type opioid receptor
Synonyms:
D-OR-1 Delta opioid receptor OPIATE Delta OPRD1 OPRK1 | opioid receptor, delta 1
Type:
G Protein-Coupled Receptor (GPCR)
Mol. Mass.:
40382.98
Organism:
Homo sapiens (Human)
Description:
Competition binding assays were carried out using membrane preparations from transfected HN9.10 cells that constitutively expressed the delta opioid receptor.
Residue:
372
  
Inhibitor
Name:
BDBM54778
Synonyms:
2-[4-(2-furanylmethyl)-5-[[(E)-3-phenylprop-2-enyl]thio]-1,2,4-triazol-3-yl]pyridine 2-[5-[[(E)-cinnamyl]thio]-4-(2-furfuryl)-1,2,4-triazol-3-yl]pyridine MLS000065151 cid_1982054
Type:
Small organic molecule
Emp. Form.:
C21H18N4OS
Mol. Mass.:
374.459
SMILES:
C(Sc1nnc(-c2ccccn2)n1Cc1ccco1)\C=C\c1ccccc1
: