Target
Trans-activator protein BZLF1
Ligand
BDBM62484
Substrate
Meas. Tech.
Counterscreen for inhibitors of EBNA-1: fluorescence polarization-based biochemical high throughput dose response assay to identify inhibitors of the Epstein-Barr virus-encoded protein, ZTA
IC50
111248±n/a nM
Citation
 PubChem, PC Counterscreen for inhibitors of EBNA-1: fluorescence polarization-based biochemical high throughput dose response assay to identify inhibitors of the Epstein-Barr virus-encoded protein, ZTA PubChem Bioassay (2010)[AID] 
Target
Name:
Trans-activator protein BZLF1
Synonyms:
BZLF1 PPP5C protein
Type:
Enzyme Catalytic Domain
Mol. Mass.:
26856.37
Organism:
Human herpesvirus 4
Description:
gi_82503229
Residue:
245
  
Inhibitor
Name:
BDBM62484
Synonyms:
9-(2,3-dimethoxyphenyl)-2-(3,4,5-trimethoxyphenyl)-5,6,7,9-tetrahydro-1H-[1,2,4]triazolo[5,1-b]quinazolin-8-one MLS000878792 cid_5771350
Type:
Small organic molecule
Emp. Form.:
C26H28N4O6
Mol. Mass.:
492.5237
SMILES:
COc1cccc(C2C3C(=O)CCCC3=Nc3nc(nn23)-c2cc(OC)c(OC)c(OC)c2)c1OC
: