Target
Trans-activator protein BZLF1
Ligand
BDBM45424
Substrate
Meas. Tech.
Counterscreen for inhibitors of EBNA-1: fluorescence polarization-based biochemical high throughput dose response assay to identify inhibitors of the Epstein-Barr virus-encoded protein, ZTA
IC50
111248±n/a nM
Citation
 PubChem, PC Counterscreen for inhibitors of EBNA-1: fluorescence polarization-based biochemical high throughput dose response assay to identify inhibitors of the Epstein-Barr virus-encoded protein, ZTA PubChem Bioassay (2010)[AID] 
Target
Name:
Trans-activator protein BZLF1
Synonyms:
BZLF1 PPP5C protein
Type:
Enzyme Catalytic Domain
Mol. Mass.:
26856.37
Organism:
Human herpesvirus 4
Description:
gi_82503229
Residue:
245
  
Inhibitor
Name:
BDBM45424
Synonyms:
MLS000109822 SMR000105759 | cid_5310620
Type:
Small organic molecule
Emp. Form.:
C22H19F3N4O4
Mol. Mass.:
460.4059
SMILES:
COc1ccc(cc1)C1CC(n2nc(cc2N1)C(=O)Nc1ccc2OCOc2c1)C(F)(F)F
: