Target
Epstein-Barr nuclear antigen 1
Ligand
BDBM62408
Substrate
Meas. Tech.
Fluorescence polarization-based biochemical high throughput dose response assay for inhibitors of the Epstein-Barr virus nuclear antigen 1 (EBNA-1)
IC50
10232±n/a nM
Citation
 PubChem, PC Fluorescence polarization-based biochemical high throughput dose response assay for inhibitors of the Epstein-Barr virus nuclear antigen 1 (EBNA-1) PubChem Bioassay (2010)[AID] 
Target
Name:
Epstein-Barr nuclear antigen 1
Synonyms:
EBNA-1 protein EBNA1_EBVB9 | Epstein-Barr virus protease (EBV Pr)
Type:
Enzyme Catalytic Domain
Mol. Mass.:
56444.81
Organism:
Human herpesvirus 4
Description:
gi_23893623
Residue:
641
  
Inhibitor
Name:
BDBM62408
Synonyms:
2-[2-Amino-1-(3-methoxy-phenyl)-4-oxo-4,5-dihydro-1H-pyrrol-3-yl]-3H-quinazolin-4-one 2-[5-amino-1-(3-methoxyphenyl)-3-oxo-2H-pyrrol-4-yl]-1H-quinazolin-4-one MLS000075886 cid_647423
Type:
Small organic molecule
Emp. Form.:
C19H16N4O3
Mol. Mass.:
348.3553
SMILES:
COc1cccc(c1)-n1cc(O)c(c1N)-c1nc2ccccc2c(=O)[nH]1
: