Target
Epstein-Barr nuclear antigen 1
Ligand
BDBM54896
Substrate
Meas. Tech.
Fluorescence polarization-based biochemical high throughput dose response assay for inhibitors of the Epstein-Barr virus nuclear antigen 1 (EBNA-1)
IC50
16774±n/a nM
Citation
 PubChem, PC Fluorescence polarization-based biochemical high throughput dose response assay for inhibitors of the Epstein-Barr virus nuclear antigen 1 (EBNA-1) PubChem Bioassay (2010)[AID] 
Target
Name:
Epstein-Barr nuclear antigen 1
Synonyms:
EBNA-1 protein EBNA1_EBVB9 | Epstein-Barr virus protease (EBV Pr)
Type:
Enzyme Catalytic Domain
Mol. Mass.:
56444.81
Organism:
Human herpesvirus 4
Description:
gi_23893623
Residue:
641
  
Inhibitor
Name:
BDBM54896
Synonyms:
BRD-K90057323-001-04-8 N'-[3-chloro-5-(trifluoromethyl)-2-pyridinyl]-N-(2-nitrophenyl)ethane-1,2-diamine [3-chloro-5-(trifluoromethyl)-2-pyridyl]-[2-(2-nitroanilino)ethyl]amine | cid_3704436
Type:
Small organic molecule
Emp. Form.:
C14H12ClF3N4O2
Mol. Mass.:
360.719
SMILES:
[O-][N+](=O)c1ccccc1NCCNc1ncc(cc1Cl)C(F)(F)F
: