Target
Epstein-Barr nuclear antigen 1
Ligand
BDBM62442
Substrate
Meas. Tech.
Fluorescence polarization-based biochemical high throughput dose response assay for inhibitors of the Epstein-Barr virus nuclear antigen 1 (EBNA-1)
IC50
9690±n/a nM
Citation
 PubChem, PC Fluorescence polarization-based biochemical high throughput dose response assay for inhibitors of the Epstein-Barr virus nuclear antigen 1 (EBNA-1) PubChem Bioassay (2010)[AID] 
Target
Name:
Epstein-Barr nuclear antigen 1
Synonyms:
EBNA-1 protein EBNA1_EBVB9 | Epstein-Barr virus protease (EBV Pr)
Type:
Enzyme Catalytic Domain
Mol. Mass.:
56444.81
Organism:
Human herpesvirus 4
Description:
gi_23893623
Residue:
641
  
Inhibitor
Name:
BDBM62442
Synonyms:
1-methyl-3-[[3-[3-(trifluoromethyl)benzyl]oxythiophene-2-carbonyl]amino]thiourea 1-methyl-3-[[3-[[3-(trifluoromethyl)phenyl]methoxy]thiophene-2-carbonyl]amino]thiourea MLS000325758 SMR000169683 | cid_1482514
Type:
Small organic molecule
Emp. Form.:
C15H14F3N3O2S2
Mol. Mass.:
389.416
SMILES:
CNC(=S)NNC(=O)c1sccc1OCc1cccc(c1)C(F)(F)F
: