Target
Epstein-Barr nuclear antigen 1
Ligand
BDBM62472
Substrate
Meas. Tech.
Fluorescence polarization-based biochemical high throughput dose response assay for inhibitors of the Epstein-Barr virus nuclear antigen 1 (EBNA-1)
IC50
19485±n/a nM
Citation
 PubChem, PC Fluorescence polarization-based biochemical high throughput dose response assay for inhibitors of the Epstein-Barr virus nuclear antigen 1 (EBNA-1) PubChem Bioassay (2010)[AID] 
Target
Name:
Epstein-Barr nuclear antigen 1
Synonyms:
EBNA-1 protein EBNA1_EBVB9 | Epstein-Barr virus protease (EBV Pr)
Type:
Enzyme Catalytic Domain
Mol. Mass.:
56444.81
Organism:
Human herpesvirus 4
Description:
gi_23893623
Residue:
641
  
Inhibitor
Name:
BDBM62472
Synonyms:
MLS000693532 N-[(4-sulfamoylanilino)-sulfanylidenemethyl]-1,3-benzodioxole-5-carboxamide N-[(4-sulfamoylphenyl)thiocarbamoyl]-piperonylamide cid_2958807
Type:
Small organic molecule
Emp. Form.:
C15H13N3O5S2
Mol. Mass.:
379.411
SMILES:
NS(=O)(=O)c1ccc(NC(=S)NC(=O)c2ccc3OCOc3c2)cc1
: