Target
Heat shock factor protein 1
Ligand
BDBM62575
Substrate
Meas. Tech.
Luminescence Cell-Based Dose Confimation HTS to Identify Inhibitors of Heat Shock Factor 1 (HSF1)
EC50
>195000±0 nM
Citation
 PubChem, PC Luminescence Cell-Based Dose Confimation HTS to Identify Inhibitors of Heat Shock Factor 1 (HSF1) PubChem Bioassay (2010)[AID] 
Target
Name:
Heat shock factor protein 1
Synonyms:
HSF1_MOUSE Hsf1 protein
Type:
Enzyme Catalytic Domain
Mol. Mass.:
57208.68
Organism:
Mus musculus
Description:
P38532
Residue:
525
  
Inhibitor
Name:
BDBM62575
Synonyms:
5-(5-Methyl-furan-2-yl)-2H-tetrazole 5-(5-methyl-2-furyl)-2H-tetrazole 5-(5-methylfuran-2-yl)-2H-tetrazole SMR000002133 | cid_655677
Type:
Small organic molecule
Emp. Form.:
C6H6N4O
Mol. Mass.:
150.138
SMILES:
Cc1ccc(o1)-c1nnn[nH]1
: