Target
Heat shock factor protein 1
Ligand
BDBM62616
Substrate
Meas. Tech.
Luminescence Cell-Based Dose Confimation HTS to Identify Inhibitors of Heat Shock Factor 1 (HSF1)
EC50
>195000±0 nM
Citation
 PubChem, PC Luminescence Cell-Based Dose Confimation HTS to Identify Inhibitors of Heat Shock Factor 1 (HSF1) PubChem Bioassay (2010)[AID] 
Target
Name:
Heat shock factor protein 1
Synonyms:
HSF1_MOUSE Hsf1 protein
Type:
Enzyme Catalytic Domain
Mol. Mass.:
57208.68
Organism:
Mus musculus
Description:
P38532
Residue:
525
  
Inhibitor
Name:
BDBM62616
Synonyms:
2-(1,3-dimethyl-2,4,6-trioxo-5,7-dihydropyrrolo[2,3-d]pyrimidin-5-yl)-N-phenylacetamide MLS000080882 SMR000047619 | cid_666357
Type:
Small organic molecule
Emp. Form.:
C16H16N4O4
Mol. Mass.:
328.3226
SMILES:
Cn1c2NC(=O)C(CC(=O)Nc3ccccc3)c2c(=O)n(C)c1=O
: