Target
Heat shock factor protein 1
Ligand
BDBM63364
Substrate
Meas. Tech.
Luminescence Cell-Based Dose Confimation HTS to Identify Inhibitors of Heat Shock Factor 1 (HSF1)
EC50
>195000±0 nM
Citation
 PubChem, PC Luminescence Cell-Based Dose Confimation HTS to Identify Inhibitors of Heat Shock Factor 1 (HSF1) PubChem Bioassay (2010)[AID] 
Target
Name:
Heat shock factor protein 1
Synonyms:
HSF1_MOUSE Hsf1 protein
Type:
Enzyme Catalytic Domain
Mol. Mass.:
57208.68
Organism:
Mus musculus
Description:
P38532
Residue:
525
  
Inhibitor
Name:
BDBM63364
Synonyms:
MLS000563777 N-[(R)-[(1R,2R)-2-butylcyclopropyl]-(4-chlorophenyl)methyl]-2-furancarboxamide SMR000388759 | cid_3247436
Type:
Small organic molecule
Emp. Form.:
C19H22ClNO2
Mol. Mass.:
331.836
SMILES:
CCCC[C@@H]1C[C@H]1[C@@H](NC(=O)c1ccco1)c1ccc(Cl)cc1
: