Target
Heat shock factor protein 1
Ligand
BDBM63404
Substrate
Meas. Tech.
Luminescence Cell-Based Dose Confimation HTS to Identify Inhibitors of Heat Shock Factor 1 (HSF1)
EC50
6290±1153 nM
Citation
 PubChem, PC Luminescence Cell-Based Dose Confimation HTS to Identify Inhibitors of Heat Shock Factor 1 (HSF1) PubChem Bioassay (2010)[AID] 
Target
Name:
Heat shock factor protein 1
Synonyms:
HSF1_MOUSE Hsf1 protein
Type:
Enzyme Catalytic Domain
Mol. Mass.:
57208.68
Organism:
Mus musculus
Description:
P38532
Residue:
525
  
Inhibitor
Name:
BDBM63404
Synonyms:
2-chloranyl-1-[3-(furan-2-yl)-5-thiophen-2-yl-3,4-dihydropyrazol-2-yl]ethanone 2-chloro-1-[3-(furan-2-yl)-5-thiophen-2-yl-3,4-dihydropyrazol-2-yl]ethanone MLS000718831 cid_3162837
Type:
Small organic molecule
Emp. Form.:
C13H11ClN2O2S
Mol. Mass.:
294.757
SMILES:
ClCC(=O)N1N=C(CC1c1ccco1)c1cccs1
: