Target
Heat shock factor protein 1
Ligand
BDBM64221
Substrate
Meas. Tech.
Luminescence Cell-Based Dose Confimation HTS to Identify Inhibitors of Heat Shock Factor 1 (HSF1)
EC50
>195000±0 nM
Citation
 PubChem, PC Luminescence Cell-Based Dose Confimation HTS to Identify Inhibitors of Heat Shock Factor 1 (HSF1) PubChem Bioassay (2010)[AID] 
Target
Name:
Heat shock factor protein 1
Synonyms:
HSF1_MOUSE Hsf1 protein
Type:
Enzyme Catalytic Domain
Mol. Mass.:
57208.68
Organism:
Mus musculus
Description:
P38532
Residue:
525
  
Inhibitor
Name:
BDBM64221
Synonyms:
2-(2,5-diketo-4,4-diphenyl-imidazolidin-1-yl)-N-(3,5-dimethoxyphenyl)acetamide MLS001176525 N-(3,5-dimethoxyphenyl)-2-(2,5-dioxo-4,4-diphenylimidazolidin-1-yl)acetamide cid_3918849
Type:
Small organic molecule
Emp. Form.:
C25H23N3O5
Mol. Mass.:
445.4672
SMILES:
COc1cc(NC(=O)CN2C(=O)NC(C2=O)(c2ccccc2)c2ccccc2)cc(OC)c1
: