Target
ATP-dependent molecular chaperone HSP82
Ligand
BDBM36903
Substrate
Meas. Tech.
Fluorescence Cell-Based Secondary Assay to Measure Toxicity of Compounds Not in the Presence of Fluconazole
EC50
>160000±0 nM
Citation
 PubChem, PC Fluorescence Cell-Based Secondary Assay to Measure Toxicity of Compounds Not in the Presence of Fluconazole PubChem Bioassay (2010)[AID] 
Target
Name:
ATP-dependent molecular chaperone HSP82
Synonyms:
heat shock protein 90
Type:
Enzyme Catalytic Domain
Mol. Mass.:
80784.12
Organism:
Candida albicans
Description:
gi_994798
Residue:
707
  
Inhibitor
Name:
BDBM36903
Synonyms:
1-[(2,4-dimethoxyphenyl)-(4-morpholinyl)methyl]-2-naphthalenol 1-[(2,4-dimethoxyphenyl)-morpholin-4-ylmethyl]naphthalen-2-ol MLS000039063 cid_621551
Type:
Small organic molecule
Emp. Form.:
C23H25NO4
Mol. Mass.:
379.4489
SMILES:
COc1ccc(C(N2CCOCC2)c2c(O)ccc3ccccc23)c(OC)c1
: