Target
ATP-dependent molecular chaperone HSP82
Ligand
BDBM34358
Substrate
Meas. Tech.
Fluorescence Cell-Based Secondary Assay to Measure Toxicity of Compounds Not in the Presence of Fluconazole
EC50
>150000±0 nM
Citation
 PubChem, PC Fluorescence Cell-Based Secondary Assay to Measure Toxicity of Compounds Not in the Presence of Fluconazole PubChem Bioassay (2010)[AID] 
Target
Name:
ATP-dependent molecular chaperone HSP82
Synonyms:
heat shock protein 90
Type:
Enzyme Catalytic Domain
Mol. Mass.:
80784.12
Organism:
Candida albicans
Description:
gi_994798
Residue:
707
  
Inhibitor
Name:
BDBM34358
Synonyms:
4-[benzyl(ethyl)sulfamoyl]-N-[5-(2-methoxyphenyl)-1,3,4-oxadiazol-2-yl]benzamide 4-{[benzyl(ethyl)amino]sulfonyl}-N-[5-(2-methoxyphenyl)-1,3,4-oxadiazol-2-yl]benzamide SMR000021835 | cid_2158923
Type:
Small organic molecule
Emp. Form.:
C25H24N4O5S
Mol. Mass.:
492.547
SMILES:
CCN(Cc1ccccc1)S(=O)(=O)c1ccc(cc1)C(=O)Nc1nnc(o1)-c1ccccc1OC
: