Target
Mu-type opioid receptor
Ligand
BDBM64842
Substrate
Meas. Tech.
Fluorescence-based biochemical high throughput dose response assay to identify inhibitors of Protein Phosphatase 1 (PP1)
IC50
3997±n/a nM
Citation
 PubChem, PC Fluorescence-based biochemical high throughput dose response assay to identify inhibitors of Protein Phosphatase 1 (PP1) PubChem Bioassay (2010)[AID] 
Target
Name:
Mu-type opioid receptor
Synonyms:
M-OR-1 MOR-1 MUOR1 Mu opiate receptor OPRM1 hMOP | mu-type opioid receptor isoform MOR-1
Type:
G Protein-Coupled Receptor (GPCR)
Mol. Mass.:
44789.51
Organism:
Homo sapiens (Human)
Description:
P35372
Residue:
400
  
Inhibitor
Name:
BDBM64842
Synonyms:
1-[4-(2-pyridin-2-ylpyrimidin-4-yl)phenyl]benzimidazole 1-[4-[2-(2-pyridyl)pyrimidin-4-yl]phenyl]benzimidazole MLS000541326 cid_1477836
Type:
Small organic molecule
Emp. Form.:
C22H15N5
Mol. Mass.:
349.388
SMILES:
c1nc2ccccc2n1-c1ccc(cc1)-c1ccnc(n1)-c1ccccn1
: