Target
Mu-type opioid receptor
Ligand
BDBM64030
Substrate
Meas. Tech.
Fluorescence-based biochemical high throughput dose response assay to identify inhibitors of Protein Phosphatase 1 (PP1)
IC50
55804±n/a nM
Citation
 PubChem, PC Fluorescence-based biochemical high throughput dose response assay to identify inhibitors of Protein Phosphatase 1 (PP1) PubChem Bioassay (2010)[AID] 
Target
Name:
Mu-type opioid receptor
Synonyms:
M-OR-1 MOR-1 MUOR1 Mu opiate receptor OPRM1 hMOP | mu-type opioid receptor isoform MOR-1
Type:
G Protein-Coupled Receptor (GPCR)
Mol. Mass.:
44789.51
Organism:
Homo sapiens (Human)
Description:
P35372
Residue:
400
  
Inhibitor
Name:
BDBM64030
Synonyms:
3-Amino-6,6-dimethyl-2-phenyl-2,8-dihydro-6H-pyrano[3,4-c]pyridazine-4-carbonitrile 3-azanyl-6,6-dimethyl-2-phenyl-8H-pyrano[3,4-c]pyridazine-4-carbonitrile SMR000513314 | cid_738951
Type:
Small organic molecule
Emp. Form.:
C16H16N4O
Mol. Mass.:
280.3244
SMILES:
CC1(C)Cc2c(CO1)nn(-c1ccccc1)c(=N)c2C#N
: