Target
Mu-type opioid receptor
Ligand
BDBM62199
Substrate
Meas. Tech.
SAR Analysis of Antagonists of the MOR Receptor using an Image-Based Assay
IC50
>32000±n/a nM
Citation
 PubChem, PC SAR Analysis of Antagonists of the MOR Receptor using an Image-Based Assay PubChem Bioassay (2010)[AID] 
Target
Name:
Mu-type opioid receptor
Synonyms:
M-OR-1 MOR-1 MUOR1 Mu opiate receptor OPRM1 hMOP | mu-type opioid receptor isoform MOR-1
Type:
G Protein-Coupled Receptor (GPCR)
Mol. Mass.:
44789.51
Organism:
Homo sapiens (Human)
Description:
P35372
Residue:
400
  
Inhibitor
Name:
BDBM62199
Synonyms:
(phenylmethyl) N-[2,2,2-tris(chloranyl)-1-(phenylcarbamothioylamino)ethyl]carbamate N-[1-[[anilino(sulfanylidene)methyl]amino]-2,2,2-trichloroethyl]carbamic acid (phenylmethyl) ester benzyl N-[2,2,2-trichloro-1-(phenylcarbamothioylamino)ethyl]carbamate | cid_4594209
Type:
Small organic molecule
Emp. Form.:
C17H16Cl3N3O2S
Mol. Mass.:
432.752
SMILES:
ClC(Cl)(Cl)C(NC(=O)OCc1ccccc1)NC(=S)Nc1ccccc1
: