Target
Trans-activator protein BZLF1
Ligand
BDBM36917
Substrate
Meas. Tech.
Counterscreen for inhibitors of PP1: fluorescence-based biochemical high throughput dose response assay to identify inhibitors of Protein Phosphatase 5 (PP5)
IC50
>67047±n/a nM
Citation
 PubChem, PC Counterscreen for inhibitors of PP1: fluorescence-based biochemical high throughput dose response assay to identify inhibitors of Protein Phosphatase 5 (PP5) PubChem Bioassay (2010)[AID] 
Target
Name:
Trans-activator protein BZLF1
Synonyms:
BZLF1 PPP5C protein
Type:
Enzyme Catalytic Domain
Mol. Mass.:
26856.37
Organism:
Human herpesvirus 4
Description:
gi_82503229
Residue:
245
  
Inhibitor
Name:
BDBM36917
Synonyms:
4-(cyclohexylamino)-2-(3,5-dimethyl-1-pyrazolyl)-5-pyrimidinecarboxylic acid ethyl ester MLS000040640 cid_662276 | ethyl 4-(cyclohexylamino)-2-(3,5-dimethylpyrazol-1-yl)pyrimidine-5-carboxylate
Type:
Small organic molecule
Emp. Form.:
C18H25N5O2
Mol. Mass.:
343.4234
SMILES:
CCOC(=O)c1cnc(nc1NC1CCCCC1)-n1nc(C)cc1C
: