Target
ATP-dependent molecular chaperone HSP82
Ligand
BDBM64893
Substrate
Meas. Tech.
Fluorescence Cell-Based Secondary Assay to Identify Inhibitors of Resistant C. albicans Growth in the Presence of Fluconazole
EC50
>160000±0 nM
Citation
 PubChem, PC Fluorescence Cell-Based Secondary Assay to Identify Inhibitors of Resistant C. albicans Growth in the Presence of Fluconazole PubChem Bioassay (2010)[AID] 
Target
Name:
ATP-dependent molecular chaperone HSP82
Synonyms:
heat shock protein 90
Type:
Enzyme Catalytic Domain
Mol. Mass.:
80784.12
Organism:
Candida albicans
Description:
gi_994798
Residue:
707
  
Inhibitor
Name:
BDBM64893
Synonyms:
2-(4-Chloro-phenoxy)-N-(2-oxo-tetrahydro-thiophen-3-yl)-acetamide 2-(4-chlorophenoxy)-N-(2-ketotetrahydrothiophen-3-yl)acetamide 2-(4-chlorophenoxy)-N-(2-oxothiolan-3-yl)acetamide SMR000012446 | cid_654685
Type:
Small organic molecule
Emp. Form.:
C12H12ClNO3S
Mol. Mass.:
285.747
SMILES:
Clc1ccc(OCC(=O)NC2CCSC2=O)cc1
: