Target
ATP-dependent molecular chaperone HSP82
Ligand
BDBM64908
Substrate
Meas. Tech.
Fluorescence Cell-Based Secondary Assay to Identify Inhibitors of Resistant C. albicans Growth in the Presence of Fluconazole
EC50
17216±1128 nM
Citation
 PubChem, PC Fluorescence Cell-Based Secondary Assay to Identify Inhibitors of Resistant C. albicans Growth in the Presence of Fluconazole PubChem Bioassay (2010)[AID] 
Target
Name:
ATP-dependent molecular chaperone HSP82
Synonyms:
heat shock protein 90
Type:
Enzyme Catalytic Domain
Mol. Mass.:
80784.12
Organism:
Candida albicans
Description:
gi_994798
Residue:
707
  
Inhibitor
Name:
BDBM64908
Synonyms:
2,6-bis(2-furanyl)-4-methyl-3-propyl-4-piperidinol;oxalic acid 2,6-bis(furan-2-yl)-4-methyl-3-propyl-piperidin-4-ol;ethanedioic acid MLS000040440 cid_664716
Type:
Small organic molecule
Emp. Form.:
C17H23NO3
Mol. Mass.:
289.3694
SMILES:
CCCC1C(NC(CC1(C)O)c1ccco1)c1ccco1
: