Target
Streptokinase A
Ligand
BDBM54874
Substrate
Meas. Tech.
Absorbance Microorganism-Based Dose Response Followup to Identify Inhibitors of Streptokinase Expression.
EC50
3140±1099 nM
Citation
 PubChem, PC Absorbance Microorganism-Based Dose Response Followup to Identify Inhibitors of Streptokinase Expression. PubChem Bioassay (2010)[AID] 
Target
Name:
Streptokinase A
Synonyms:
STRP_STRP1 streptokinase A precursor
Type:
Enzyme Catalytic Domain
Mol. Mass.:
49924.80
Organism:
Streptococcus pyogenes M1 GAS
Description:
gi_15675770
Residue:
440
  
Inhibitor
Name:
BDBM54874
Synonyms:
2-chloranyl-N-[3-cyano-4-(4-methoxyphenyl)sulfanyl-phenyl]benzamide 2-chloro-N-[3-cyano-4-[(4-methoxyphenyl)thio]phenyl]benzamide MLS002699833, ML135 | cid_2769229
Type:
Small organic molecule
Emp. Form.:
C21H15ClN2O2S
Mol. Mass.:
394.874
SMILES:
COc1ccc(Sc2ccc(NC(=O)c3ccccc3Cl)cc2C#N)cc1
: