Target
Streptokinase A
Ligand
BDBM65747
Substrate
Meas. Tech.
Absorbance Microorganism-Based Dose Response Followup to Identify Inhibitors of Streptokinase Expression.
EC50
3251±1077 nM
Citation
 PubChem, PC Absorbance Microorganism-Based Dose Response Followup to Identify Inhibitors of Streptokinase Expression. PubChem Bioassay (2010)[AID] 
Target
Name:
Streptokinase A
Synonyms:
STRP_STRP1 streptokinase A precursor
Type:
Enzyme Catalytic Domain
Mol. Mass.:
49924.80
Organism:
Streptococcus pyogenes M1 GAS
Description:
gi_15675770
Residue:
440
  
Inhibitor
Name:
BDBM65747
Synonyms:
4-chloranyl-N-(3-cyano-4-phenylsulfanyl-phenyl)benzamide 4-chloro-N-[3-cyano-4-(phenylthio)phenyl]benzamide cid_1471787
Type:
Small organic molecule
Emp. Form.:
C20H13ClN2OS
Mol. Mass.:
364.848
SMILES:
Clc1ccc(cc1)C(=O)Nc1ccc(Sc2ccccc2)c(c1)C#N
: