Target
Nucleotide-binding oligomerization domain-containing protein 1
Ligand
BDBM64826
Substrate
Meas. Tech.
SAR analysis of Antagonists of the GPR35 Receptor using an Image-Based Assay - Set 2
IC50
1160±n/a nM
Citation
 PubChem, PC SAR analysis of Antagonists of the GPR35 Receptor using an Image-Based Assay - Set 2 PubChem Bioassay (2010)[AID] 
Target
Name:
Nucleotide-binding oligomerization domain-containing protein 1
Synonyms:
CARD4 NOD1_HUMAN | nucleotide-binding oligomerization domain containing 1
Type:
Enzyme Catalytic Domain
Mol. Mass.:
107699.03
Organism:
Homo sapiens (Human)
Description:
gi_5174617
Residue:
953
  
Inhibitor
Name:
BDBM64826
Synonyms:
MLS-0304362.0001 N-(4-hydroxyphenyl)-4-[(5Z)-5-[(4-methoxyphenyl)methylidene]-4-oxidanylidene-2-sulfanylidene-1,3-thiazolidin-3-yl]butanamide N-(4-hydroxyphenyl)-4-[(5Z)-5-[(4-methoxyphenyl)methylidene]-4-oxo-2-sulfanylidene-3-thiazolidinyl]butanamide | cid_1356907
Type:
Small organic molecule
Emp. Form.:
C21H20N2O4S2
Mol. Mass.:
428.524
SMILES:
COc1ccc(\C=C2/SC(=S)N(CCCC(=O)Nc3ccc(O)cc3)C2=O)cc1
: