Target
Tumor necrosis factor
Ligand
BDBM38909
Substrate
Meas. Tech.
SAR analysis of inhibitors of TNFa specific NF-kB induction - Set 2
IC50
5210±n/a nM
Citation
 PubChem, PC SAR analysis of inhibitors of TNFa specific NF-kB induction - Set 2 PubChem Bioassay (2010)[AID] 
Target
Name:
Tumor necrosis factor
Synonyms:
Cachectin TNF-a TNFA TNFSF2 Tumor necrosis factor (TNFa) Tumor necrosis factor ligand superfamily member 2 Tumor necrosis factor, soluble form | tumor necrosis factor alpha
Type:
Enzyme
Mol. Mass.:
25645.11
Organism:
Homo sapiens (Human)
Description:
P01375
Residue:
233
  
Inhibitor
Name:
BDBM38909
Synonyms:
7-[(E)-3-chloranylbut-2-enyl]-1,3-dimethyl-8-(2-phenylethylamino)purine-2,6-dione 7-[(E)-3-chlorobut-2-enyl]-1,3-dimethyl-8-(phenethylamino)xanthine SMR000044779 | cid_5389756
Type:
Small organic molecule
Emp. Form.:
C19H22ClN5O2
Mol. Mass.:
387.863
SMILES:
C\C(Cl)=C/Cn1c(NCCc2ccccc2)nc2n(C)c(=O)n(C)c(=O)c12
: