Target
Amyloid-beta A4 precursor protein-binding family A member 1
Ligand
BDBM40691
Substrate
Meas. Tech.
SAR analysis of small molecule inhibitors of Mint-PDZ and N-type Ca2+ channel carboxyl-terminal peptide association using HTRF
IC50
39300±n/a nM
Citation
 PubChem, PC SAR analysis of small molecule inhibitors of Mint-PDZ and N-type Ca2+ channel carboxyl-terminal peptide association using HTRF PubChem Bioassay (2010)[AID] 
Target
Name:
Amyloid-beta A4 precursor protein-binding family A member 1
Synonyms:
APBA1_RAT Mint1 neuronal munc18-1 binding protein
Type:
Enzyme Catalytic Domain
Mol. Mass.:
92603.32
Organism:
Rattus norvegicus
Description:
gi_2625023
Residue:
839
  
Inhibitor
Name:
BDBM40691
Synonyms:
2-(2-furanyl)-N-[2-(4-morpholinyl)phenyl]-4-quinolinecarboxamide 2-(furan-2-yl)-N-(2-morpholin-4-ylphenyl)quinoline-4-carboxamide SMR000153919 | cid_2361912
Type:
Small organic molecule
Emp. Form.:
C24H21N3O3
Mol. Mass.:
399.4418
SMILES:
O=C(Nc1ccccc1N1CCOCC1)c1cc(nc2ccccc12)-c1ccco1
: