Target
Amyloid-beta A4 precursor protein-binding family A member 1
Ligand
BDBM65763
Substrate
Meas. Tech.
SAR analysis of small molecule inhibitors of Mint-PDZ and N-type Ca2+ channel carboxyl-terminal peptide association using HTRF
IC50
21500±n/a nM
Citation
 PubChem, PC SAR analysis of small molecule inhibitors of Mint-PDZ and N-type Ca2+ channel carboxyl-terminal peptide association using HTRF PubChem Bioassay (2010)[AID] 
Target
Name:
Amyloid-beta A4 precursor protein-binding family A member 1
Synonyms:
APBA1_RAT Mint1 neuronal munc18-1 binding protein
Type:
Enzyme Catalytic Domain
Mol. Mass.:
92603.32
Organism:
Rattus norvegicus
Description:
gi_2625023
Residue:
839
  
Inhibitor
Name:
BDBM65763
Synonyms:
2-(2-furanyl)-4-quinolinecarboxylic acid [2-(2-methoxyanilino)-2-oxoethyl] ester MLS-0315879.0001 [2-[(2-methoxyphenyl)amino]-2-oxidanylidene-ethyl] 2-(furan-2-yl)quinoline-4-carboxylate | cid_7997784
Type:
Small organic molecule
Emp. Form.:
C23H18N2O5
Mol. Mass.:
402.3994
SMILES:
COc1ccccc1NC(=O)COC(=O)c1cc(nc2ccccc12)-c1ccco1
: