Target
Amyloid-beta A4 precursor protein-binding family A member 1
Ligand
BDBM40991
Substrate
Meas. Tech.
SAR analysis of small molecule inhibitors of Mint-PDZ and N-type Ca2+ channel carboxyl-terminal peptide association using HTRF
IC50
21700±n/a nM
Citation
 PubChem, PC SAR analysis of small molecule inhibitors of Mint-PDZ and N-type Ca2+ channel carboxyl-terminal peptide association using HTRF PubChem Bioassay (2010)[AID] 
Target
Name:
Amyloid-beta A4 precursor protein-binding family A member 1
Synonyms:
APBA1_RAT Mint1 neuronal munc18-1 binding protein
Type:
Enzyme Catalytic Domain
Mol. Mass.:
92603.32
Organism:
Rattus norvegicus
Description:
gi_2625023
Residue:
839
  
Inhibitor
Name:
BDBM40991
Synonyms:
5,6-bis(2-furanyl)-4-furo[2,3-d]pyrimidinamine MLS000107834 [5,6-bis(2-furyl)furo[2,3-d]pyrimidin-4-yl]amine | cid_704725
Type:
Small organic molecule
Emp. Form.:
C14H9N3O3
Mol. Mass.:
267.2396
SMILES:
Nc1ncnc2oc(-c3ccco3)c(-c3ccco3)c12
: