Target
Kappa-type opioid receptor
Ligand
BDBM65814
Substrate
Meas. Tech.
SAR analysis of Antagonists of the Kappa Opioid Receptor (KOR) using an Image-Based Assay - Set 2
IC50
>32000±n/a nM
Citation
 PubChem, PC SAR analysis of Antagonists of the Kappa Opioid Receptor (KOR) using an Image-Based Assay - Set 2 PubChem Bioassay (2010)[AID] 
Target
Name:
Kappa-type opioid receptor
Synonyms:
K-OR-1 Kappa-opioid receptor (KOR) Kappa-type opioid receptor (KOR) OPIATE Kappa OPRK1 kappa opioid receptor (KOR)
Type:
G Protein-Coupled Receptor (GPCR)
Mol. Mass.:
42648.76
Organism:
Homo sapiens (Human)
Description:
P41145
Residue:
380
  
Inhibitor
Name:
BDBM65814
Synonyms:
KSC-10-10 N-[(1S)-1-(cyclohexylcarbamoyl)-1-methyl-propyl]-N-(2-furfuryl)picolinamide N-[(2S)-1-(cyclohexylamino)-2-methyl-1-oxobutan-2-yl]-N-(2-furanylmethyl)-2-pyridinecarboxamide cid_7287789
Type:
Small organic molecule
Emp. Form.:
C22H29N3O3
Mol. Mass.:
383.484
SMILES:
CC[C@](C)(N(Cc1ccco1)C(=O)c1ccccn1)C(=O)NC1CCCCC1
: