Target
Kappa-type opioid receptor
Ligand
BDBM65819
Substrate
Meas. Tech.
SAR analysis of small molecule agonists of the kappa opioid receptor via a luminescent beta-arrestin assay - Set 2
EC50
6210±n/a nM
Citation
 PubChem, PC SAR analysis of small molecule agonists of the kappa opioid receptor via a luminescent beta-arrestin assay - Set 2 PubChem Bioassay (2010)[AID] 
Target
Name:
Kappa-type opioid receptor
Synonyms:
K-OR-1 Kappa-opioid receptor (KOR) Kappa-type opioid receptor (KOR) OPIATE Kappa OPRK1 kappa opioid receptor (KOR)
Type:
G Protein-Coupled Receptor (GPCR)
Mol. Mass.:
42648.76
Organism:
Homo sapiens (Human)
Description:
P41145
Residue:
380
  
Inhibitor
Name:
BDBM65819
Synonyms:
2-[4-(2-furanylmethyl)-5-[(4-methylphenyl)methylthio]-1,2,4-triazol-3-yl]pyridine 2-[4-(furan-2-ylmethyl)-5-[(4-methylphenyl)methylsulfanyl]-1,2,4-triazol-3-yl]pyridine KUC103895N | cid_44601474
Type:
Small organic molecule
Emp. Form.:
C20H18N4OS
Mol. Mass.:
362.448
SMILES:
Cc1ccc(CSc2nnc(-c3ccccn3)n2Cc2ccco2)cc1
: