Target
Interleukin-8
Ligand
BDBM65731
Substrate
Meas. Tech.
SAR analysis of GM-Tri-DAP induced IL-8 secretion in MCF-7/NOD1 cells - Set 2
IC50
3310±860.4 nM
Citation
 PubChem, PC SAR analysis of GM-Tri-DAP induced IL-8 secretion in MCF-7/NOD1 cells - Set 2 PubChem Bioassay (2010)[AID] 
Target
Name:
Interleukin-8
Synonyms:
CXCL8 IL8_HUMAN interleukin 8 precursor
Type:
PROTEIN
Mol. Mass.:
11104.05
Organism:
Homo sapiens (Human)
Description:
ChEMBL_577736
Residue:
99
  
Inhibitor
Name:
BDBM65731
Synonyms:
3-methyl-7-(phenylmethyl)-8-(propan-2-ylthio)purine-2,6-dione 7-benzyl-3-methyl-8-propan-2-ylsulfanylpurine-2,6-dione MLS-0342317.0001 | cid_814607
Type:
Small organic molecule
Emp. Form.:
C16H18N4O2S
Mol. Mass.:
330.405
SMILES:
CC(C)Sc1nc2n(C)c(=O)[nH]c(=O)c2n1Cc1ccccc1
: