Target
NADPH oxidase 1
Ligand
BDBM65848
Substrate
Meas. Tech.
Luminescence-based cell-based dose response assay to identify inhibitors of NADPH oxidase 1 (NOX1)
IC50
176±n/a nM
Citation
 PubChem, PC Luminescence-based cell-based dose response assay to identify inhibitors of NADPH oxidase 1 (NOX1) PubChem Bioassay (2010)[AID] 
Target
Name:
NADPH oxidase 1
Synonyms:
MOX-1 Mitogenic oxidase 1 NOH-1 NOX-1 NOX1_HUMAN
Type:
PROTEIN
Mol. Mass.:
64890.44
Organism:
Homo sapiens (Human)
Description:
ChEMBL_792877
Residue:
564
  
Inhibitor
Name:
BDBM65848
Synonyms:
1-[4-(diethylamino)phenyl]-3-phenyl-urea SR-01000410731 cid_732314
Type:
Small organic molecule
Emp. Form.:
C17H21N3O
Mol. Mass.:
283.3681
SMILES:
CCN(CC)c1ccc(NC(=O)Nc2ccccc2)cc1
: