Target
NADPH oxidase 1
Ligand
BDBM42323
Substrate
Meas. Tech.
Luminescence-based cell-based dose response assay to identify inhibitors of NADPH oxidase 1 (NOX1)
IC50
156±n/a nM
Citation
 PubChem, PC Luminescence-based cell-based dose response assay to identify inhibitors of NADPH oxidase 1 (NOX1) PubChem Bioassay (2010)[AID] 
Target
Name:
NADPH oxidase 1
Synonyms:
MOX-1 Mitogenic oxidase 1 NOH-1 NOX-1 NOX1_HUMAN
Type:
PROTEIN
Mol. Mass.:
64890.44
Organism:
Homo sapiens (Human)
Description:
ChEMBL_792877
Residue:
564
  
Inhibitor
Name:
BDBM42323
Synonyms:
1-(10H-phenothiazin-2-yl)ethanone SMR000033635 | cid_81131
Type:
Small organic molecule
Emp. Form.:
C14H11NOS
Mol. Mass.:
241.308
SMILES:
CC(=O)c1ccc2Sc3ccccc3Nc2c1
: