Target
Glucose-6-phosphate 1-dehydrogenase
Ligand
BDBM46732
Substrate
Meas. Tech.
G6DPH counterscreen for TbHK1 inhibitors - Analogues series
IC50
>25000±n/a nM
Citation
 PubChem, PC G6DPH counterscreen for TbHK1 inhibitors - Analogues series PubChem Bioassay (2010)[AID] 
Target
Name:
Glucose-6-phosphate 1-dehydrogenase
Synonyms:
G6PD_LEUME zwf
Type:
Enzyme Catalytic Domain
Mol. Mass.:
54421.26
Organism:
Leuconostoc mesenteroides
Description:
gi_149631
Residue:
486
  
Inhibitor
Name:
BDBM46732
Synonyms:
2-(4-chlorophenyl)-5-fluoranyl-1,2-benzothiazol-3-one MLS-0390975.0001 | cid_25241618
Type:
Small organic molecule
Emp. Form.:
C13H7ClFNOS
Mol. Mass.:
279.717
SMILES:
Fc1ccc2sn(-c3ccc(Cl)cc3)c(=O)c2c1
: