Target
Glucose-6-phosphate 1-dehydrogenase
Ligand
BDBM61956
Substrate
Meas. Tech.
G6DPH counterscreen for TbHK1 inhibitors - Analogues series
IC50
>25000±n/a nM
Citation
 PubChem, PC G6DPH counterscreen for TbHK1 inhibitors - Analogues series PubChem Bioassay (2010)[AID] 
Target
Name:
Glucose-6-phosphate 1-dehydrogenase
Synonyms:
G6PD_LEUME zwf
Type:
Enzyme Catalytic Domain
Mol. Mass.:
54421.26
Organism:
Leuconostoc mesenteroides
Description:
gi_149631
Residue:
486
  
Inhibitor
Name:
BDBM61956
Synonyms:
4-bromanyl-2-(4-bromophenyl)-1,2-thiazol-3-one 4-bromo-2-(4-bromophenyl)-3-isothiazolone KSC-6-161 cid_45254019
Type:
Small organic molecule
Emp. Form.:
C9H5Br2NOS
Mol. Mass.:
335.015
SMILES:
Brc1csn(-c2ccc(Br)cc2)c1=O
: