Target
Glucose-6-phosphate 1-dehydrogenase
Ligand
BDBM62002
Substrate
Meas. Tech.
G6DPH counterscreen for TbHK1 inhibitors - Analogues series
IC50
>25000±n/a nM
Citation
 PubChem, PC G6DPH counterscreen for TbHK1 inhibitors - Analogues series PubChem Bioassay (2010)[AID] 
Target
Name:
Glucose-6-phosphate 1-dehydrogenase
Synonyms:
G6PD_LEUME zwf
Type:
Enzyme Catalytic Domain
Mol. Mass.:
54421.26
Organism:
Leuconostoc mesenteroides
Description:
gi_149631
Residue:
486
  
Inhibitor
Name:
BDBM62002
Synonyms:
4-chloranyl-2-[(4-methoxyphenyl)amino]benzoic acid 4-chloro-2-(p-anisidino)benzoic acid KUC105914N | cid_66674
Type:
Small organic molecule
Emp. Form.:
C14H12ClNO3
Mol. Mass.:
277.703
SMILES:
COc1ccc(Nc2cc(Cl)ccc2C(O)=O)cc1
: