Target
Glucose-6-phosphate 1-dehydrogenase
Ligand
BDBM62036
Substrate
Meas. Tech.
G6DPH counterscreen for TbHK1 inhibitors - Analogues series
IC50
>25000±n/a nM
Citation
 PubChem, PC G6DPH counterscreen for TbHK1 inhibitors - Analogues series PubChem Bioassay (2010)[AID] 
Target
Name:
Glucose-6-phosphate 1-dehydrogenase
Synonyms:
G6PD_LEUME zwf
Type:
Enzyme Catalytic Domain
Mol. Mass.:
54421.26
Organism:
Leuconostoc mesenteroides
Description:
gi_149631
Residue:
486
  
Inhibitor
Name:
BDBM62036
Synonyms:
4-chloranyl-2-[(3,4,5-trimethoxyphenyl)carbonylamino]benzoic acid 4-chloro-2-[[oxo-(3,4,5-trimethoxyphenyl)methyl]amino]benzoic acid KUC106005N | cid_16772990
Type:
Small organic molecule
Emp. Form.:
C17H16ClNO6
Mol. Mass.:
365.765
SMILES:
COc1cc(cc(OC)c1OC)C(=O)Nc1cc(Cl)ccc1C(O)=O
: