Target
Inward rectifier potassium channel 2
Ligand
BDBM43753
Substrate
Meas. Tech.
Confirmation dose response assay for compounds that inhibit/block inward-rectifying potassium ion channel Kir2.1
IC50
33369±35763 nM
Citation
 PubChem, PC Confirmation dose response assay for compounds that inhibit/block inward-rectifying potassium ion channel Kir2.1 PubChem Bioassay (2010)[AID] 
Target
Name:
Inward rectifier potassium channel 2
Synonyms:
Irk1 Kcnj2 | inward rectifier potassium channel 2
Type:
Enzyme Catalytic Domain
Mol. Mass.:
48383.35
Organism:
Mus musculus
Description:
gi_6680530
Residue:
428
  
Inhibitor
Name:
BDBM43753
Synonyms:
6-methyl-N-(phenylmethyl)-1H-benzimidazol-2-amine N-benzyl-6-methyl-1H-benzimidazol-2-amine benzyl-(6-methyl-1H-benzimidazol-2-yl)amine | cid_665867
Type:
Small organic molecule
Emp. Form.:
C15H15N3
Mol. Mass.:
237.2997
SMILES:
Cc1ccc2nc(NCc3ccccc3)[nH]c2c1
: