Target
Potassium voltage-gated channel subfamily H member 2
Ligand
BDBM65906
Substrate
Meas. Tech.
Dosage response for compounds that protect hERG from block by proarrhythmic agents using manual patch clamp
EC50
107200±n/a nM
Citation
 PubChem, PC Dosage response for compounds that protect hERG from block by proarrhythmic agents using manual patch clamp PubChem Bioassay (2010)[AID] 
Target
Name:
Potassium voltage-gated channel subfamily H member 2
Synonyms:
1,3-beta-glucan synthase component GLS2 ERG Eag-related protein 1 Ether-a-go-go-related gene (HERG) Ether-a-go-go-related gene potassium channel 1 Ether-a-go-go-related gene potassium channel 1 (hERG1) Ether-a-go-go-related protein 1 H-ERG KCNH2 Potassium voltage-gated channel subfamily H member 2 (hERG) Voltage-gated potassium channel subunit Kv11.1 hERG Potassium Channel 1 | putative potassium channel subunit
Type:
Multi-pass membrane protein
Mol. Mass.:
126672.65
Organism:
Homo sapiens (Human)
Description:
Q12809
Residue:
1159
  
Inhibitor
Name:
BDBM65906
Synonyms:
5-chloranyl-2-[(5-chloranyl-1,3-benzoxazol-2-yl)amino]benzoic acid VU0404032-1 | cid_44216771
Type:
Small organic molecule
Emp. Form.:
C14H8Cl2N2O3
Mol. Mass.:
323.131
SMILES:
OC(=O)c1cc(Cl)ccc1Nc1nc2cc(Cl)ccc2o1
: