Target
Muscarinic acetylcholine receptor M1
Ligand
BDBM65908
Substrate
Meas. Tech.
Discovery of Novel Allosteric Modulators of the M1 Muscarinic Receptor: PAM Calcium Assay SAR
EC50
6540±n/a nM
Citation
 PubChem, PC Discovery of Novel Allosteric Modulators of the M1 Muscarinic Receptor: PAM Calcium Assay SAR PubChem Bioassay (2010)[AID] 
Target
Name:
Muscarinic acetylcholine receptor M1
Synonyms:
ACM1_RAT Chrm-1 cholinergic receptor, muscarinic 1
Type:
Enzyme Catalytic Domain
Mol. Mass.:
51390.46
Organism:
RAT
Description:
P08482
Residue:
460
  
Inhibitor
Name:
BDBM65908
Synonyms:
2-(1-m-anisylindol-3-yl)sulfonyl-N-(5-methylisoxazol-3-yl)acetamide 2-[1-[(3-methoxyphenyl)methyl]indol-3-yl]sulfonyl-N-(5-methyl-1,2-oxazol-3-yl)ethanamide VU0366971-1 | cid_44129593
Type:
Small organic molecule
Emp. Form.:
C22H21N3O5S
Mol. Mass.:
439.484
SMILES:
COc1cccc(Cn2cc(c3ccccc23)S(=O)(=O)CC(=O)Nc2cc(C)on2)c1
: