Target
Fatty acid synthase
Ligand
BDBM269307
Substrate
Meas. Tech.
Fatty Acid Synthase (FASN) Inhibition Scintillation Proximity Assay
pH
7.5±n/a
Temperature
298.15±n/a K
IC50
562±n/a nM
Comments
extracted
Citation
 Connolly, PJLu, T Imidazolin-5-one derivative useful as FASN inhibitors for the treatment of cancer US Patent  US9718813 Publication Date 8/1/2017 
Target
Name:
Fatty acid synthase
Synonyms:
FAS FAS_HUMAN HU FASN
Type:
Enzyme
Mol. Mass.:
273419.37
Organism:
Homo sapiens (Human)
Description:
P49327
Residue:
2511
  
Inhibitor
Name:
BDBM269307
Synonyms:
2-(4-(benzo[d]oxazol-2-yl)-2-fluorophenyl)-1-((1-(cyclopropanecarbonyl)azetidin-3-yl)methyl)-4,4-dimethyl-1H-imidazol-5(4H)-one US9718813, Compound 52
Type:
Small organic molecule
Emp. Form.:
C26H25FN4O3
Mol. Mass.:
460.5001
SMILES:
CC1(C)N=C(N(CC2CN(C2)C(=O)C2CC2)C1=O)c1ccc(cc1F)-c1nc2ccccc2o1
: