Target
Fatty acid synthase
Ligand
BDBM269328
Substrate
Meas. Tech.
Fatty Acid Synthase (FASN) Inhibition Scintillation Proximity Assay
pH
7.5±n/a
Temperature
298.15±n/a K
IC50
66.1±n/a nM
Comments
extracted
Citation
 Connolly, PJLu, T Imidazolin-5-one derivative useful as FASN inhibitors for the treatment of cancer US Patent  US9718813 Publication Date 8/1/2017 
Target
Name:
Fatty acid synthase
Synonyms:
FAS FAS_HUMAN HU FASN
Type:
Enzyme
Mol. Mass.:
273419.37
Organism:
Homo sapiens (Human)
Description:
P49327
Residue:
2511
  
Inhibitor
Name:
BDBM269328
Synonyms:
(R)-2-(2-fluoro-4-(1-methyl-1H-indazol-5-yl)phenyl)-4,4-dimethyl-1-((1-(1-methylcyclopropanecarbonyl)pyrrolidin-3-yl)methyl)-1H-imidazol-5(4H)-one US9718813, Compound 73
Type:
Small organic molecule
Emp. Form.:
C29H32FN5O2
Mol. Mass.:
501.5951
SMILES:
Cn1ncc2cc(ccc12)-c1ccc(C2=NC(C)(C)C(=O)N2C[C@@H]2CCN(C2)C(=O)C2(C)CC2)c(F)c1
: