Target
Fatty acid synthase
Ligand
BDBM269329
Substrate
Meas. Tech.
Fatty Acid Synthase (FASN) Inhibition Scintillation Proximity Assay
pH
7.5±n/a
Temperature
298.15±n/a K
IC50
55.0±n/a nM
Comments
extracted
Citation
 Connolly, PJLu, T Imidazolin-5-one derivative useful as FASN inhibitors for the treatment of cancer US Patent  US9718813 Publication Date 8/1/2017 
Target
Name:
Fatty acid synthase
Synonyms:
FAS FAS_HUMAN HU FASN
Type:
Enzyme
Mol. Mass.:
273419.37
Organism:
Homo sapiens (Human)
Description:
P49327
Residue:
2511
  
Inhibitor
Name:
BDBM269329
Synonyms:
(R)-2-(3-fluoro-4'-(1-methyl-1H-pyrazol-4-yl)-[1,1'-biphenyl]-4-yl)-4,4-dimethyl-1-((1-(1-methylcyclopropanecarbonyl)pyrrolidin-3-yl)methyl)-1H-imidazol-5(4H)-one US9718813, Compound 74
Type:
Small organic molecule
Emp. Form.:
C31H34FN5O2
Mol. Mass.:
527.6324
SMILES:
Cn1cc(cn1)-c1ccc(cc1)-c1ccc(C2=NC(C)(C)C(=O)N2C[C@@H]2CCN(C2)C(=O)C2(C)CC2)c(F)c1
: