Target
Fatty acid synthase
Ligand
BDBM269339
Substrate
Meas. Tech.
Fatty Acid Synthase (FASN) Inhibition Scintillation Proximity Assay
pH
7.5±n/a
Temperature
298.15±n/a K
IC50
53.7±n/a nM
Comments
extracted
Citation
 Connolly, PJLu, T Imidazolin-5-one derivative useful as FASN inhibitors for the treatment of cancer US Patent  US9718813 Publication Date 8/1/2017 
Target
Name:
Fatty acid synthase
Synonyms:
FAS FAS_HUMAN HU FASN
Type:
Enzyme
Mol. Mass.:
273419.37
Organism:
Homo sapiens (Human)
Description:
P49327
Residue:
2511
  
Inhibitor
Name:
BDBM269339
Synonyms:
(R)-4,4-dimethyl-2-(3-methyl-4'-(1-methyl-1H-pyrazol-4-yl)-[1,1'-biphenyl]-4-yl)-1-((1-(1-methylcyclopropanecarbonyl)pyrrolidin-3-yl)methyl)-1H-imidazol-5(4H)-one US9718813, Compound 84
Type:
Small organic molecule
Emp. Form.:
C32H37N5O2
Mol. Mass.:
523.6685
SMILES:
Cc1cc(ccc1C1=NC(C)(C)C(=O)N1C[C@@H]1CCN(C1)C(=O)C1(C)CC1)-c1ccc(cc1)-c1cnn(C)c1
: