Target
1,5-anhydro-D-fructose reductase
Ligand
BDBM269288
Substrate
Meas. Tech.
Fatty Acid Synthase Keto-reductase Domain (FASN KR) Inhibition
pH
7.5±n/a
Temperature
298.15±n/a K
IC50
417±n/a nM
Comments
extracted
Citation
 Connolly, PJLu, T Imidazolin-5-one derivative useful as FASN inhibitors for the treatment of cancer US Patent  US9718813 Publication Date 8/1/2017 
Target
Name:
1,5-anhydro-D-fructose reductase
Synonyms:
AF reductase AKR1CL2 AKRDC1 Aldo-keto reductase family 1 member E2 | LoopADR
Type:
Enzyme Catalytic Domain
Mol. Mass.:
36595.42
Organism:
Homo sapiens (Human)
Description:
Q96JD6
Residue:
320
  
Inhibitor
Name:
BDBM269288
Synonyms:
1-((1-(cyclopropanecarbonyl)azetidin-3-yl)methyl)-2-(3-fluoro-4'-(1-methyl-1H-pyrazol-4-yl)-[1,1'-biphenyl]-4-yl)-4,4-dimethyl-1H-imidazol-5(4H)-one US9718813, Compound 33
Type:
Small organic molecule
Emp. Form.:
C29H30FN5O2
Mol. Mass.:
499.5792
SMILES:
Cn1cc(cn1)-c1ccc(cc1)-c1ccc(C2=NC(C)(C)C(=O)N2CC2CN(C2)C(=O)C2CC2)c(F)c1
: